{"text_format":"1","workbook":"xlsx","n_sheets":4,"sheets":["Veil","Fixed Rate","FieldFinder","Agreement"],"not_rendered":{"charts":0,"images":4,"macros":1,"external_links":1,"defined_names":5,"comments":1,"pivot_tables":0},"unopened":[],"bounds":{"document_bytes":16777216,"sheet_cells":100000,"rows_first":2000,"rows_last":500,"rows_between":2000,"halvings":0,"cell_chars":16384,"cell_head_chars":4096},"cells_cut":0,"cells_raw":0,"read":"whole","date_system":"1900"}

{"sheet":"Veil","index":0,"n_rows":22,"n_cols":3,"rows_kept":22,"cut":false,"hidden":false,"merged":[]}
[]
[]
[]
[null,null," Copy Protection Test in Progress"]
[]
[null,null,"This sheet should appear temporarily while your computer runs"]
[null,null,"a brief test of a third party copy protection system."]
[]
[]
[null,null,"If this sheet remains on your screen for more that a 30 seconds,"]
[null,null,"one of three known conditions likely exists."]
[]
[null,null,"1. an internet connection is not available"]
[]
[null,null,"2.  this copy is not registered for this computer,"]
[null,null,"you can obtain subscription info by contacting"]
[null,null,"www.mortgagementor.com/contact-us"]
[]
[null,null,"3. you are registering a new Mortgage Mentor installation on a MAC"]
[]
{"$rows_left_out":3}
{"sheet":"Fixed Rate","index":1,"n_rows":157,"n_cols":44,"rows_kept":157,"cut":false,"hidden":true,"merged":[[143,1,143,2],[31,1,31,2],[32,1,32,2],[34,1,34,2],[75,1,75,2],[76,1,76,2],[77,1,77,2],[78,1,78,2],[79,1,79,2],[55,1,55,2],[56,1,56,2],[69,1,69,2],[70,1,70,2],[71,1,71,2],[72,1,72,2],[74,1,74,2],[73,1,73,2],[64,1,64,2],[65,1,65,2],[66,1,66,2],[67,1,67,2],[68,1,68,2],[62,1,62,2],[63,1,63,2],[23,1,23,2],[24,1,24,2],[25,1,25,2],[26,1,26,2],[8,1,8,2],[9,1,9,2],[10,1,10,2],[29,1,29,2],[30,1,30,2],[15,1,15,2],[16,1,16,2],[0,14,0,43],[1,13,1,44],[2,24,2,27],[2,28,2,31],[2,16,2,22],[2,32,2,41],[3,43,4,43],[4,39,5,39],[3,32,4,32],[3,23,3,24],[3,41,4,41],[3,31,4,31],[3,38,3,39],[3,35,4,35],[3,37,4,37],[3,36,4,36],[3,42,4,42],[3,26,4,26],[3,25,4,25],[3,27,4,27],[3,33,4,33],[3,34,4,34],[3,16,3,17],[3,29,4,29],[156,28,156,30],[151,28,151,30],[152,28,152,30],[154,28,154,30],[153,28,153,30],[149,28,149,30],[3,28,4,28],[3,30,4,30],[3,18,3,19],[3,20,3,22],[149,1,149,12],[3,4,4,4],[3,6,4,6],[3,9,3,10],[3,7,4,7],[3,15,4,15],[3,8,4,8],[3,14,4,14],[3,12,4,12],[49,1,49,2],[50,1,50,2],[51,1,51,2],[7,1,7,2],[44,1,44,2],[45,1,45,2],[46,1,46,2],[57,1,57,2],[58,1,58,2],[59,1,59,2],[60,1,60,2],[61,1,61,2],[52,1,52,2],[53,1,53,2],[54,1,54,2],[1,1,4,2],[6,1,6,2],[17,1,17,2],[18,1,18,2],[19,1,19,2],[47,1,47,2],[48,1,48,2],[2,4,2,9],[3,5,4,5],[1,3,1,12],[2,11,2,12],[43,1,43,2],[20,1,20,2],[21,1,21,2],[22,1,22,2],[33,1,33,2],[37,1,37,2],[14,1,14,2],[11,1,11,2],[13,1,13,2],[35,1,35,2],[36,1,36,2],[38,1,38,2],[39,1,39,2],[92,1,92,2],[93,1,93,2],[94,1,94,2],[85,1,85,2],[86,1,86,2],[87,1,87,2],[88,1,88,2],[89,1,89,2],[80,1,80,2],[81,1,81,2],[82,1,82,2],[83,1,83,2],[84,1,84,2],[145,1,145,2],[127,1,127,2],[129,1,129,2],[130,1,130,2],[131,1,131,2],[132,1,132,2],[120,1,120,2],[121,1,121,2],[124,1,124,2],[125,1,125,2],[126,1,126,2],[140,1,140,2],[142,1,142,2],[134,1,134,2],[122,1,122,2],[123,1,123,2],[141,1,141,2],[135,1,135,2],[136,1,136,2],[137,1,137,2],[138,1,138,2],[128,1,128,2],[144,1,144,2],[139,1,139,2],[103,1,103,2],[104,1,104,2],[12,1,12,2],[27,1,27,2],[28,1,28,2],[40,1,40,2],[41,1,41,2],[42,1,42,2],[133,1,133,2],[105,1,105,2],[106,1,106,2],[107,1,107,2],[108,1,108,2],[109,1,109,2],[100,1,100,2],[95,1,95,2],[96,1,96,2],[97,1,97,2],[98,1,98,2],[99,1,99,2],[101,1,101,2],[102,1,102,2],[90,1,90,2],[91,1,91,2],[115,1,115,2],[116,1,116,2],[117,1,117,2],[118,1,118,2],[119,1,119,2],[110,1,110,2],[111,1,111,2],[112,1,112,2],[113,1,113,2],[114,1,114,2]]}
[]
[null,"The Best Fixed Rate mortgage tool since the fax machine!!\nNot updated past May 31 2018",null,"© printing or copying this page or any portion of this page, in any way, without prior written permission of the author is prohibited ",null,null,null,null,null,null,null,null,null,{"$f":"REPT(\"Armand FIXED Rate by MORTGAGE MENTOR     : : :    \",9)","v":"Armand FIXED Rate by MORTGAGE MENTOR     : : :    Armand FIXED Rate by MORTGAGE MENTOR     : : :    Armand FIXED Rate by MORTGAGE MENTOR     : : :    Armand FIXED Rate by MORTGAGE MENTOR     : : :    Armand FIXED Rate by MORTGAGE MENTOR     : : :    Armand FIXED Rate by MORTGAGE MENTOR     : : :    Armand FIXED Rate by MORTGAGE MENTOR     : : :    Armand FIXED Rate by MORTGAGE MENTOR     : : :    Armand FIXED Rate by MORTGAGE MENTOR     : : :    "}]
[null,null,null,null,"PRODUCT SELECTION - Fixed Rate",null,null,null,null,null,"BFS & NIQ","Debt Consolidation",null,null,null,null,"DEBT SERVICING",null,null,null,null,null,null,"RATE",null,null,null,null,"CLIENT OPTIONS",null,null,null,"GENERAL"]
[null,null,null,null,"Lending Area","LTV (%) Maximum","Beacon Minimum","Bankrupt","Terms Available","Loan Amount",null,"Cash Back","Flex-Down Payment","Equity ","Purpose","Property Type","Insurable",null,"Un-Insurable",null,"Amortization",null,null,"Qualifying Rate",null,"Rate","Rate Hold \nperiod","Rate \nBuy-Down","Payment Options","Annual Prepayment (%)","Payment Increase Option (%)","Pre-Payment \nPenalty","Appraisal","Title Insurance","Appl. Fee","New to Canada","Portable","Assume","Switch-In",null,"Legal","Refinance","Trailer Fees","Volume Bonus"]
[null,null,null,null,null,null,null,null,null,"Minimum","Maximum","Available",null,"Minimum",null,null,"GDS %","TDS %","GDS %","TDS %","Insurable","Un-Insurable","Minimum","Insurable","Un-Insurable",null,null,null,null,null,null,null,null,null,null,null,null,null,"Info","Lender Pay"]
[null,"Column Finder - click here.",null,null,null,null,null,null,null,null,null,null,null,null,null,null,null,null,null,null,null,null,null,null,null,null,null,null,null,null,null,"1st 5 yrs"]
["C.G.","Canada Guaranty   ( standard )",null,null,"National",95,"per Lender","2 years","per Lender","per Lender","$925,000 \nplus ins."," -","Yes","5% \n5%+10%","Purch","O/O to 4 Units, Second Home, \nSmall Rental, Vacation Type B","35/39","42/44","n/a","n/a",25,"n/a","per lender","higher of Deal Rate \nor 5yr Benchmark","n/a","per Lender","per Lender","per Lender","per Lender","per Lender","per Lender","per Lender","case by case","per Lender","No","Yes","Yes","Yes","No"," -","Std.","No"," -"," -"]
["C.G.","Canada Guaranty   ( Lifestyle Advantage )",null,null,"National",95,"per Lender","2 years","per Lender","per Lender","$925,000 \nplus ins."," -","Yes","5% \n5%+10%","Purch","O/O 1 Unit Second Home, or \nImmediate Family occupied",39,44,"n/a","n/a",25,"n/a","per lender","higher of Deal Rate \nor 5yr Benchmark","n/a","per Lender","per Lender","per Lender","per Lender","per Lender","per Lender","per Lender","case by case","per Lender","No","Yes","Yes","Yes","No"," -","Std.","No"," -"," -"]
["C.G.","Canada Guaranty \n                   ( Purchase Advantage Plus )",null,null,"National",95,"per Lender","2 years","per Lender","per Lender","$925,000 \nplus ins."," -"," -","5% \n5%+10%","Purch Plus Improv. \nSee comment for details","O/O to 4 Units, Second Home","35/39","42/44","n/a","n/a",25,"n/a","per lender","higher of Deal Rate \nor 5yr Benchmark","n/a","per Lender","per Lender","per Lender","per Lender","per Lender","per Lender","per Lender","when adding $40k+ or 20%+","per Lender","No","Yes","Yes","Yes","No"," -","Std.","No"," -"," -"]
["C.G.","Canada Guaranty \n                      ( Maple Leaf Advantage )",null,null,"National",95,"per Lender","n/a","per Lender","per Lender","$925,000 \nplus ins."," -"," -","5% \n5%+10%","Purch","O/O to 4 Units, Second Home, \nSmall Rental, Vacation Type B","35/39","42/44","n/a","n/a",25,"n/a","per lender","higher of Deal Rate \nor 5yr Benchmark","n/a","per Lender","per Lender","per Lender","per Lender","per Lender","per Lender","per Lender","case by case","per Lender","No","Yes","Yes","Yes","No"," -","Std.","No"," -"," -"]
[null,"CMHC                     ( standard )",null,null,"National",95,610,"Case-by-case","Fixed, VRM, ARM, Capped","per Lender","$925,000 \nplus ins."," -","Yes","Own Resource, Gift, or Borrowed","Purch","O/O to 4 Units, \n2-4 Unit Small Rental","35/39","42/44","n/a","n/a",25,"n/a","per lender","higher of Deal Rate \nor 5yr Benchmark","n/a","per Lender","per Lender","per Lender","per Lender","per Lender","per Lender","per Lender","case by case","per Lender","No","Yes","Yes","Yes","Yes"," -","Std.","No"," -"," -"]
[null,"CMHC                  ( New To Credit )",null,null,"National",95,600,"Case-by-case","Fixed, VRM, ARM, Capped","per Lender","$925,000 \nplus ins."," -","Yes","Own Resource, Gift, or Borrowed","Purch","O/O to 4 Units","35/39","42/44","n/a","n/a",25,"n/a","per lender","higher of Deal Rate \nor 5yr Benchmark","n/a","per Lender","per Lender","per Lender","per Lender","per Lender","per Lender","per Lender","case by case","per Lender","No","Yes","Yes","Yes","Yes"," -","Std.","No"," -"," -"]
[null,"CMHC                  ( Improvement )",null,null,"National",95,610,"Case-by-case","Fixed, VRM, ARM, Capped","per Lender","$925,000 \nplus ins."," -","Yes","Own Resource, Gift, or Borrowed","Purch Plus Improv., ","O/O to 4 Units","35/39","42/44","n/a","n/a",25,"n/a","per lender","higher of Deal Rate \nor 5yr Benchmark","n/a","per Lender","per Lender","per Lender","per Lender","per Lender","per Lender","per Lender","case by case","per Lender","No"," -","Yes","Yes","No"," -","Std.","No"," -"," -"]
["GNW","Genworth               ( standard )",null,null,"National",95,600,"2 years","Fixed, Capped","per Lender","$925,000 \nplus ins."," -","Yes","Own Resource or Gift","Purch","O/O to 4 Units, Second Home, \nSmall Rental, Vacation Type B","35/39","42/44","n/a","n/a",25,"n/a","per lender","higher of Deal Rate \nor 5yr Benchmark","n/a","per Lender","per Lender","per Lender","per Lender","per Lender","per Lender","per Lender","case by case","per Lender","No"," -","Yes","Yes","Yes"," -","Std.","No"," -"," -"]
["GNW","Genworth ( Purchase Plus Improvement )",null,null,"National",95,600,"2 years","Fixed, VRM, ARM, Capped","per Lender","$925,000 \nplus ins."," -","Yes","Own Resource, Gift, Borrowed","Purch Plus Improv. \nSee comment for details","O/O to 4 Units, Second Home, \nSmall Rental, Vacation Type B","35/39","42/44","n/a","n/a",25,"n/a","per lender","higher of Deal Rate \nor 5yr Benchmark","n/a","per Lender","per Lender","per Lender","per Lender","per Lender","per Lender","per Lender","case by case","per Lender","No","Yes","Yes","Yes","No"," -","Std.","No"," -"," -"]
["GNW","Genworth              ( Family Plan )",null,null,"National",95,600,"No","Fixed, VRM, ARM, Capped","per Lender","$925,000 \nplus ins.","-","No","Own Resource","Purch, Purch Plus Improv.","O/O max 2 Units, \nExisting & New Construction","35/39","42/44","n/a","n/a",25,"n/a","per lender","higher of Deal Rate \nor 5yr Benchmark","n/a","per Lender","per Lender","per Lender","per Lender","per Lender","per Lender","per Lender","case by case","per Lender","No"," -","Yes","Yes","No"," -","Std.","No"," -"," -"]
["GNW","Genworth            ( New To Canada )",null,null,"National",95,"n/a","No","Fixed, VRM, ARM, Capped","per Lender","$925,000 \nplus ins."," -","No","Own Resource","Purch, \nPurch Plus Improv.","O/O max 2 Units","35/39","42/44","n/a","n/a",25,"n/a","per lender","higher of Deal Rate \nor 5yr Benchmark","n/a","per Lender","per Lender","per Lender","per Lender","per Lender","per Lender","per Lender","case by case","per Lender","No","Yes","Yes","Yes","No"," -","Std.","No"," -"," -"]
["GNW","Genworth    ( Vacation / Secondary Home )\n                                   TYPE A   1st & 2nd",null,null,"National",95,600,"No","Fixed, VRM, ARM, Capped","per Lender","$750,000 \nplus ins."," -","Yes","Own Resource, Gift","Purch, \nPurch Plus Improv.","O/O max 1 Unit",39,44,"n/a","n/a",25,"n/a","per lender","higher of Deal Rate \nor 5yr Benchmark","n/a","per Lender","per Lender","per Lender","per Lender","per Lender","per Lender","per Lender","case by case","per Lender","No"," -","Yes","Yes","No"," -","Std.","No"," -"," -"]
["GNW","Genworth    ( Vacation / Secondary Home )\n                                   TYPE B   1st",null,{"$f":"VLOOKUP(A19,'[1]My Six'!$F$5:$G$33,2,FALSE)","v":{"$error":"#N/A"}},"National",90,680,"No","Fixed, VRM, ARM, Capped","per Lender","$350,000\nplus ins."," -","No","Own Resource","Purch, \nPurch Plus Improv.","O/O max 1 Unit",39,44,"n/a","n/a",25,"n/a","per lender","higher of Deal Rate \nor 5yr Benchmark","n/a","per Lender","per Lender","per Lender","per Lender","per Lender","per Lender","per Lender","case by case","per Lender","No"," -","Yes","Yes","No"," -","Std.","No"," -"," -"]
["B2B Bank","B2B Bank  Insurable",null,null,"National",95,600,"2 years","1,2,3,4,5,7,10\n6 mo.",50000,"$925,000 \nplus ins.","1%, 2%, 3%, 4%, 5%","Yes","Own Resource, Gift, or Borrowed","Purch, Purch Plus Improv.","O/O to 2 Units, \nSecond Home, Small Rental",39,44," -"," -",25,35,"Term","higher of Deal Rate \nor 5yr Benchmark"," -","Best",120,"Yes","w,bw,m",15,15,"greater 3mo\n or IRD","Lender List\n or service","Always","No","No","Yes","On Qual","Yes"," -","Std.","FCT Platinum"," -","Yes"]
{"$rows_left_out":138}
{"sheet":"FieldFinder","index":2,"n_rows":47,"n_cols":2,"rows_kept":47,"cut":false,"hidden":true,"merged":[[0,0,0,9],[2,0,2,1],[3,1,3,2]]}
["This sheet is the source sheet name where the column headings are for the field search"]
[]
["Column A contains column Heading to display"]
[null,"Column B contains the heading sheet&cell address "]
[]
["Title to Display","Reference Cell"]
["Column Finder - click here",{"$f":"'Fixed Rate'!D7","v":0}]
["Amortization Conventional",{"$f":"'Fixed Rate'!U4","v":"Amortization"}]
["Amortization High Ratio",{"$f":"'Fixed Rate'!U4","v":"Amortization"}]
["Amortization Minimum",{"$f":"'Fixed Rate'!U4","v":"Amortization"}]
["Annual Prepayment (%)",{"$f":"'Fixed Rate'!$AD$4","v":"Annual Prepayment (%)"}]
["Application Fee",{"$f":"'Fixed Rate'!$AI$4","v":"Appl. Fee"}]
["Appraisal",{"$f":"'Fixed Rate'!$AG$4","v":"Appraisal"}]
["Assume",{"$f":"'Fixed Rate'!$AL$4","v":"Assume"}]
["Bankrupt",{"$f":"'Fixed Rate'!$H$4","v":"Bankrupt"}]
["Beacon Minimum",{"$f":"'Fixed Rate'!$G$4","v":"Beacon Minimum"}]
["Cash Back Available",{"$f":"'Fixed Rate'!$L$4","v":"Cash Back"}]
["Equity Minimum",{"$f":"'Fixed Rate'!$N$4","v":"Equity "}]
["Flex-Down Payment",{"$f":"'Fixed Rate'!$M$4","v":"Flex-Down Payment"}]
["GDS % Conventional",{"$f":"'Fixed Rate'!$S$4","v":"Un-Insurable"}]
{"$rows_left_out":28}
{"sheet":"Agreement","index":3,"n_rows":47,"n_cols":2,"rows_kept":47,"cut":false,"hidden":true,"merged":[]}
[]
[null,"Mortgage Mentor: Disclaimer, Privacy Policy, and License Agreement"]
[]
[null,"Read the terms and conditions of this license agreement carefully.  "]
[null,"By: downloading, otherwise receiving, or using a copy of the program, you are accepting and agreeing to the terms of this license agreement."]
[null,"continued…"]
[null,"1.     The program is copyrighted and licensed (not sold). This is a legal agreement between you (either an individual end-user or an entity) and MMI Mortgage Mentor Inc. (“MMI”) . If you do not agree to the terms and conditions of this agreement, you must promptly stop using the Software, remove it from any computer on which you have installed it, and destroy all aspects of the Software in your possession or control."]
[null,"continued…"]
[null,"2.      At MMI, we are committed to respecting and protecting your privacy and security.  We have taken measures to protect the security of your personal information and protect your data from misuse and unauthorized access or disclosure. While any data transmissions over the internet cannot be guaranteed 100%, MMI would like to reassure our subscribers that our site www.mortgagementor.com is protected by CopyMinder (www.copyminder.com). To further protect your security, we are providing each subscriber with a unique Product Key for their personal use only.  By using this software you agree that your Product Key shall not be shared, distributed or broadcast to any other parties."]
[null,"continued…"]
[null,"3.    Each Product Key and Mortgage Mentor Tool (from herein referred to as “Software”) are protected by CopyMinder.  Periodically throughout the duration of your subscription, your Product Key and computer ID will need to be re-validated by COPY minder's protection system. To facilitate this, your computer will need to be connected to the internet.  No data is copied, installed, or accessed from your computer during this process. You agree to allow CopyMinder access to the Software installed on your computer solely for such re-validation purposes."]
[null,"continued…"]
[null,"4.     The Software that is made available for downloading from our online server is owned by MMI.  This Software is protected by copyright laws, and is  licensed to you on a non-exclusive limited basis to be used by you in accordance with the terms and conditions described herein.  Any use, reproduction or redistribution of the Software that is not in accordance with the terms and conditions in this agreement is expressly prohibited by law, and may result in civil and criminal penalties."]
[null,"continued…"]
[null,"5.     This Software is licensed, not sold, for use under the terms and conditions of this agreement, and MMI reserves all rights not expressly granted in this agreement. Without limiting the generality of the forgoing MMI retains ownership of  the Software, and all intellectual property rights therein.  As such, you acknowledge and agree that MMI holds all rights to title and interest in all tangible and intangible incidents of the product and/or service, including copyrights and trade secrets pertaining thereto, and that this agreement conveys to you only a limited right to access and use of the product and/or service.  Subject to the terms and conditions of this agreement, MMI grants to you a non-exclusive limited license to use one copy of the Software and any documentation accompanying this agreement on one computer only.  No other rights are granted.  You may not use the Software on different computers concurrently using the same Product Key.  Attempts to install this Software on a second computer will cause the original, authorized installation to malfunction."]
[null,"continued…"]
[null,"6.      The Software contains copyrighted concepts, ideas, and other proprietary materials of MMI. You agree not to analyze, reverse engineer, decompile or disassemble the Software, or any part of the Software.  You also agree to not modify or create derivative works of the Software, combine with or incorporate the Software into any other application Software, print a copy of the Software, reproduce, distribute, publish, resell for profit, broadcast, transmit or provide its functionality, or commercially exploit the Software and any information available on this site in any matter without the express consent of MMI. AND IS PROHIBITED WITHOUT THE EXPRESS WRITTEN PERMISSION OF MMI."]
[null,"continued…"]
[null,"7.      The Software is considered in use if it is loaded on the computer’s permanent or temporary memory.  If you are acquiring the Software on behalf of another person or entity, you represent and warrant that you have the authority to bind the party or entity for which you are acquiring the Software to the terms and conditions of this agreement."]
[null,"continued…"]
{"$rows_left_out":27}