{"text_format":"1","workbook":"xlsx","n_sheets":9,"sheets":["Veil","Introduction","Qualifying","The Options","Save More report","Rent Instead report","PTT & Closing Costs","Parameters","Agreement"],"not_rendered":{"charts":0,"images":3,"macros":1,"external_links":1,"defined_names":45,"comments":6,"pivot_tables":0},"unopened":[],"bounds":{"document_bytes":16777216,"sheet_cells":100000,"rows_first":2000,"rows_last":500,"rows_between":2000,"halvings":0,"cell_chars":16384,"cell_head_chars":4096},"cells_cut":0,"cells_raw":0,"read":"whole","date_system":"1900"}

{"sheet":"Veil","index":0,"n_rows":22,"n_cols":3,"rows_kept":22,"cut":false,"hidden":false,"merged":[]}
[]
[]
[]
[null,null," Copy Protection Test in Progress"]
[]
[null,null,"This sheet should appear temporarily while your computer runs"]
[null,null,"a brief test of a third party copy protection system."]
[]
[]
[null,null,"If this sheet remains on your screen for more that a 30 seconds,"]
{"$rows_left_out":13}
{"sheet":"Introduction","index":1,"n_rows":61,"n_cols":6,"rows_kept":61,"cut":false,"hidden":true,"merged":[[62,2,62,11],[41,5,41,11],[39,5,39,11],[52,2,52,11],[57,2,57,11],[58,3,58,11],[60,3,60,11],[61,2,61,11],[45,1,45,4],[6,1,6,11],[7,1,7,11],[11,3,11,11],[59,2,59,11],[50,2,51,11],[46,2,47,11],[54,2,54,4],[55,3,56,11],[53,1,53,4],[49,1,49,4],[37,2,37,11],[35,2,35,11],[41,2,41,4],[43,2,43,4],[43,5,43,11],[25,3,25,11],[1,0,1,13],[2,0,2,13],[3,0,3,6],[3,7,3,12],[34,2,34,11],[9,2,9,11],[13,2,13,11],[8,2,8,11],[17,1,17,2],[5,1,5,11],[15,1,15,11],[28,2,28,11],[12,3,12,11],[18,2,18,11],[14,1,14,11],[10,3,10,11],[38,2,38,11],[16,1,16,11],[26,3,26,11],[27,3,27,11],[30,1,30,2],[24,2,24,11],[32,2,32,11],[33,2,33,11],[31,2,31,11]]}
[]
[]
["Should We: Buy Now, Wait, or Rent & Save for retirement ?"]
[]
[]
[null,"This unique tool has been created to help the new wave of younger, more informed buyers quickly make effective decisions about getting into home ownership."]
[]
[null,"There seem to be three main questions, with three possible variations facing First Time Home Buyers today"]
[null,"*","Should we Buy Now?"]
[null,"*","Should we Wait and Save More down payment?"]
{"$rows_left_out":52}
{"sheet":"Qualifying","index":2,"n_rows":48,"n_cols":17,"rows_kept":48,"cut":false,"hidden":true,"merged":[[41,14,42,14],[36,16,37,16],[36,12,37,12],[38,14,39,14],[41,3,41,4],[39,3,39,5],[35,11,35,16],[36,13,37,13],[37,3,37,4],[37,1,37,2],[36,1,36,3],[47,0,47,7],[45,0,45,7],[10,5,10,6],[41,1,41,2],[27,1,27,3],[35,6,35,8],[42,3,42,5],[38,3,38,5],[43,3,43,5],[31,6,31,7],[38,1,38,2],[39,1,39,2],[42,1,42,2],[43,1,43,2],[5,0,5,1],[5,2,5,7],[1,0,1,7],[2,0,2,7],[3,4,3,7],[3,1,3,3]]}
[]
[{"$f":"'[1]Your Data'!$D$8&\"    \"&'[1]Your Data'!$D$14","v":"Enter \"My Info\" data    Enter \"My Info\" data"}]
["Pre-Qualifier workbook"]
[null,{"$f":"'[1]Your Data'!$D$9","v":"Enter \"My Info\" data"},null,null,{"$f":"'[1]Your Data'!$D$10","v":"Enter \"My Info\" data"}]
[]
["Prepared for"]
[]
[null,"INCOME",null,"annual","monthly"]
[null,null,"Applicant Income",null,{"$f":"D9/12","v":0}]
[null,null,"Co-Applicant Income",null,{"$f":"D10/12","v":0}]
{"$rows_left_out":39}
{"sheet":"The Options","index":3,"n_rows":309,"n_cols":34,"rows_kept":309,"cut":false,"hidden":true,"merged":[[27,1,27,2],[10,30,10,31],[7,10,8,10],[7,13,8,13],[7,16,8,16],[7,17,8,17],[7,18,8,18],[7,1,7,2],[9,30,9,31],[22,1,22,3],[12,5,12,6],[21,1,21,3],[1,30,1,32],[1,25,1,28],[7,23,8,23],[7,27,8,27],[7,25,8,25],[1,22,1,23],[2,22,2,23],[7,22,8,22],[7,26,8,26],[4,30,4,31],[5,30,5,31],[6,30,6,31],[34,2,34,3],[32,2,32,3],[33,2,33,3],[15,2,15,3],[1,16,1,19],[2,10,2,12],[3,10,3,12],[1,10,1,13],[3,16,3,18],[2,16,2,18],[7,19,8,19],[17,2,17,3],[18,2,18,3],[7,11,8,11],[7,12,8,12],[11,1,11,3],[31,2,31,3],[30,2,30,3],[25,1,25,3],[1,1,1,6],[2,1,2,6],[8,1,8,2],[23,1,23,3],[3,1,3,2],[3,4,3,6],[9,2,9,3],[14,2,14,3],[13,1,13,3],[6,0,6,1],[6,5,6,6],[6,3,6,4],[28,2,28,3],[41,2,41,3],[38,1,38,6],[39,1,39,6],[40,1,40,6],[52,1,52,6],[46,1,46,6],[47,1,49,6],[43,2,43,3],[44,2,44,3],[42,2,42,3]]}
[]
[null,{"$f":"'[1]Your Data'!$D$8","v":"Enter \"My Info\" data"},null,null,null,null,null,null,null,null,"\" What If  We Wait\" Factors",null,null,null,null,null,"Today's Known Factors",null,null,null,null,null,"Property Equity",null,null,"Rent and Save Difference",null,null,null,null,{"$f":"IF(AH18>0,\"entries required\",\"\")","v":"entries required"}]
[null,{"$f":"'[1]Your Data'!$D$14","v":"Enter \"My Info\" data"},null,null,null,null,null,null,null,null,"Rate after your changes",null,null,{"$f":"E9+E22","v":0},null,null,"Present Interest rate",null,null,{"$f":"E9","v":0},null,null,"net of R.E. commission",null,null,null,null,null,null,null,null,null,"monthly amount"]
[null,{"$f":"'[1]Your Data'!$D$9","v":"Enter \"My Info\" data"},null,null,{"$f":"'[1]Your Data'!$D$10","v":"Enter \"My Info\" data"},null,null,null,null,null,"Mortgage after your changes",null,null,{"$f":"E34","v":0},null,null,"Mortgage at today's values",null,null,{"$f":"E17","v":0},null,null,null,null,null,null,null,null,null,null,"Taxes",null,null,{"$f":"IF(AG4<1,1,0)","v":1}]
[null,null,null,null,null,null,null,null,null,null,null,null,null,null,null,null,null,null,null,null,null,null,null,null,null,null,null,null,null,null,"Heat (above rental)",null,null,{"$f":"IF(AG5<1,1,0)","v":1}]
[null,null,null,null,null,null,null,null,null,null,null,null,null,null,null,null,null,null,null,null,null,null,null,null,null,null,null,null,null,null,"Maintenance"]
["File #",null,null,"Save Until (mm/dd/yy) ",null,null,null,null,null,null,null,null,null,null,null,null,null,null,null,null,null,null,null,null,null,null,null,null,"Cash",null,"Strata"]
[null,null,null,null,null,null,null,null,null,null,"Payment","Interest","Principle","Mortgage Balance",null,null,"Payment","Interest","Principle","Mortgage Balance",null,null,"Property Value","Property Equity",null,"Rent","Savings","Interest Earned","Balance",null,"House Insurance",null,null,{"$f":"IF(AG6<1,1,0)","v":1}]
[null,"Today's mortgage rate %",null,null,null,null,null,null,"month",null,null,null,null,null,null,null,null,null,null,null,null,null,null,null,null,null,null,null,{"$f":"E14","v":0},null,null,null,{"$f":"SUM(AG4:AG8)","v":0}]
[null,null,"Amortization ( in years )",null,25,{"$f":"IF(ISBLANK(E12),\"\",IF(AND(E14>0,E10>25,E14/E12<0.2),\"for that Down Payment Max 25 years\",\" \"))","v":""},null,null,1,null,{"$f":"IF(E34=0,0,-PMT((1+($N$3/2))^(0.166666666666667)-1,E10*12,$N$4,0,0))","v":0},{"$f":"(((1+(N$3/2))^2^(1/12))-1)*N4","v":0},{"$f":"K10-L10","v":0},{"$f":"N4-M10","v":0},null,null,{"$f":"IF(ISBLANK(E14),0,-PMT((1+($E$9/2))^(0.166666666666667)-1,E10*12,E17,0,0))","v":0},{"$f":"(((1+(E$9/2))^2^(1/12))-1)*T4","v":0},{"$f":"Q10-R10","v":0},{"$f":"T4-S10","v":0},null,null,{"$f":"E$12*(1+(E$23/12))","v":0},{"$f":"IF(W10=0,0,W10-T10-(7000+(0.0025*(T10-100000))))","v":0},null,{"$f":"AG14","v":0},{"$f":"Q$10+AG$9-Z10","v":0},{"$f":"AC9*(AG$13/12)","v":0},{"$f":"AC9+AB10+AA10","v":0},null,"Mortgage Payment",null,{"$f":"E18","v":0},{"$f":"IF(AG8<1,1,0)","v":1}]
{"$rows_left_out":300}
{"sheet":"Save More report","index":4,"n_rows":137,"n_cols":16,"rows_kept":137,"cut":false,"hidden":true,"merged":[[6,7,6,15],[15,15,16,15],[15,14,16,14],[13,6,13,8],[9,6,9,14],[13,12,13,14],[15,8,16,8],[15,12,16,12],[11,6,11,9],[11,12,11,15],[15,9,16,9],[15,6,16,6],[8,6,8,14],[0,2,0,15],[1,2,1,15],[2,2,2,15],[3,2,3,8],[3,9,3,14],[5,6,5,14],[7,6,7,14],[15,7,16,7],[12,6,12,8],[12,12,12,14],[15,13,16,13],[6,4,6,6]]}
[null,null,"Provided by:"]
[null,null,{"$f":"'[1]Your Data'!$D$8","v":"Enter \"My Info\" data"}]
[null,null,{"$f":"'[1]Your Data'!$D$14","v":"Enter \"My Info\" data"}]
[null,null,{"$f":"'[1]Your Data'!$D$9","v":"Enter \"My Info\" data"},null,null,null,null,null,null,{"$f":"'[1]Your Data'!$D$10","v":"Enter \"My Info\" data"}]
[]
[null,null,null,null,null,null,"\"Wait and Save More\"  vs  \"Buy Now\"  ~ Payment Tables"]
[null,null,null,null,{"$f":"IF(ISBLANK(Qualifying!C6),\"\",\"Prepared for:\")","v":""},null,null,{"$f":"IF(ISBLANK(Qualifying!C6),\"\",Qualifying!C6)","v":""},null,null,{"$f":"IF(ISBLANK(Qualifying!I6),\"\",\"Prepared for:\")","v":""},null,null,{"$f":"IF(ISBLANK(Qualifying!L6),\"\",\"Prepared for:\")","v":""}]
[null,null,null,null,null,null,"This table show results for the two buying options you've selected"]
[null,null,null,null,null,null,"The first is based on your \"What If We Wait \" factors, the second is todays known factors,  "]
[null,null,null,null,null,null,"Table shows: Monthly Payment,  how much is: interest,  principal,  and balance owing"]
{"$rows_left_out":128}
{"sheet":"Rent Instead report","index":5,"n_rows":137,"n_cols":16,"rows_kept":137,"cut":false,"hidden":true,"merged":[[5,1,5,13],[7,1,7,13],[0,1,0,14],[1,1,1,14],[2,1,2,14],[3,1,3,7],[3,8,3,13],[6,1,6,3],[6,4,6,13],[29,1,29,2],[31,1,32,2],[31,3,32,3],[12,7,12,8],[17,1,17,3],[18,1,18,3],[26,1,26,2],[27,1,27,2],[15,6,16,6],[15,7,16,7],[15,12,16,12],[15,8,16,8],[8,1,8,13],[9,1,9,13],[11,7,11,8],[11,10,11,13],[15,10,16,10],[12,10,12,13],[15,11,16,11]]}
[null,"Provided by:"]
[null,{"$f":"'[1]Your Data'!$D$8","v":"Enter \"My Info\" data"}]
[null,{"$f":"'[1]Your Data'!$D$14","v":"Enter \"My Info\" data"}]
[null,{"$f":"'[1]Your Data'!$D$9","v":"Enter \"My Info\" data"},null,null,null,null,null,null,{"$f":"'[1]Your Data'!$D$9","v":"Enter \"My Info\" data"}]
[]
[null,"Building Equity for Future or Retirement"]
[null,{"$f":"IF(ISBLANK(Qualifying!C6),\"\",\"Prepared for:\")","v":""},null,null,{"$f":"IF(ISBLANK(Qualifying!C6),\"\",Qualifying!C6)","v":""}]
[null,"This table compares  \"Renting & Saving\"   vs.  \"Owning & Building Equity in a Home\""]
[null,"Comparison considers saving the difference between the rent you would pay"]
[null,"versus  Mortgage Payment + Home Ownership costs"]
{"$rows_left_out":128}
{"sheet":"PTT & Closing Costs","index":6,"n_rows":68,"n_cols":63,"rows_kept":68,"cut":false,"hidden":true,"merged":[[26,50,26,51],[23,50,23,52],[8,46,8,47],[7,46,7,47],[6,46,6,48],[7,48,7,50],[7,51,7,53],[10,46,10,47],[8,51,8,53],[14,50,14,52],[13,53,13,56],[23,53,23,56],[25,53,25,54],[26,53,26,54],[14,53,14,56],[10,48,10,50],[10,51,10,53],[16,46,16,47],[14,46,14,49],[13,46,13,48],[9,46,9,47],[8,48,8,50],[9,48,9,50],[9,51,9,53],[13,11,13,13],[13,14,13,16],[16,14,17,16],[14,11,14,13],[14,14,14,16],[59,1,59,4],[57,38,57,39],[26,38,26,39],[38,1,38,3],[44,38,44,40],[46,38,46,39],[47,38,47,39],[23,34,23,37],[23,38,23,40],[25,11,25,12],[14,38,14,41],[57,0,57,2],[58,38,58,39],[58,40,58,41],[53,38,53,39],[19,14,20,16],[55,3,56,3],[55,38,55,39],[55,40,55,41],[56,42,56,43],[56,38,56,39],[56,40,56,41],[52,38,52,39],[17,11,17,12],[18,11,18,12],[57,42,57,43],[57,40,57,41],[58,42,58,43],[51,38,51,39],[26,30,26,31],[55,42,55,43],[23,46,23,49],[24,38,24,39],[24,42,25,45],[25,38,25,39],[33,46,33,48],[49,38,50,39],[45,38,45,41],[26,34,26,35],[54,42,54,43],[54,38,54,39],[19,1,19,3],[20,27,21,29],[23,14,24,16],[23,24,23,26],[23,30,23,33],[24,11,24,12],[21,11,21,12],[22,11,22,12],[19,11,19,12],[20,11,20,12],[8,60,8,61],[13,7,13,8],[15,11,15,13],[15,14,15,16],[15,17,15,20],[15,21,15,23],[15,24,15,26],[12,7,12,8],[8,14,8,15],[11,46,11,48],[14,34,14,37],[14,17,14,20],[14,21,14,23],[14,24,14,26],[14,27,14,29],[13,17,13,20],[15,50,15,52],[15,53,15,56],[14,7,14,8],[15,7,15,8],[15,27,15,29],[15,30,15,33],[15,34,15,37],[15,38,15,41],[7,38,7,39],[11,4,11,5],[11,14,11,15],[11,16,11,18],[11,38,11,39],[11,44,11,45],[7,14,7,18],[6,38,6,39],[14,42,14,45],[8,4,8,5],[8,7,8,8],[9,14,9,15],[9,16,9,18],[9,38,9,39],[8,16,8,18],[8,38,8,39],[14,30,14,33],[13,27,13,29],[10,14,10,15],[10,16,10,18],[10,38,10,39],[13,34,13,37],[13,21,13,23],[13,24,13,26],[1,1,1,5],[1,15,1,18],[1,21,1,22],[1,24,1,26],[1,28,1,30],[2,1,2,5],[2,15,2,17],[2,21,2,22],[7,7,7,8],[3,1,3,2],[3,3,3,5],[3,15,3,17],[4,28,4,29],[6,1,6,3],[8,1,8,2],[27,53,27,54],[28,53,28,54],[29,53,29,54],[30,53,30,54],[31,53,31,54],[16,53,16,54],[17,53,17,54],[18,53,18,54],[19,53,19,54],[20,53,20,54],[21,53,21,55],[16,7,16,8],[23,11,23,12],[17,27,18,29],[15,42,15,45],[15,46,15,49],[13,30,13,33],[13,42,13,45],[13,50,13,52],[13,38,13,41],[17,34,17,35],[17,30,17,31],[16,11,16,12]]}
[]
[null,{"$f":"'[1]Your Data'!$D$8","v":"Enter \"My Info\" data"}]
[null,{"$f":"'[1]Your Data'!$D$14","v":"Enter \"My Info\" data"}]
[null,{"$f":"'[1]Your Data'!$D$9","v":"Enter \"My Info\" data"},null,{"$f":"'[1]Your Data'!$D$10","v":"Enter \"My Info\" data"}]
[]
[]
[null,"Property Transfer Tax Calculations ( rates confirmed Jan 6, 2020 )",null,null,null,{"$f":"IF(ISBLANK(E7),\"< Click to select Region\",\"\")","v":"< Click to select Region"},null,null,null,null,null,null,null,null,null,null,null,null,null,null,null,null,null,null,null,null,null,null,null,null,null,null,null,null,null,null,null,null,"\"ON\" \"Toronto\" \"PEI\"",null,"Tax","FTB's Tax",null,null,null,null,"\"PQ\" \"Montreal\" \"SK\" YK\""]
[null,null,{"$f":"IF(OR(E7=\"On\",E7=\"Toronto\"),\"Property price (excluding any GST or HST)\",IF(OR(E7=\"QC\",E7=\"Montreal\"),\"Property price (excluding any GST & QST)\",\"Property price (including any GST or HST)\"))","v":"Property price (including any GST or HST)"},null,{"$f":"IF(AND(E7<>\"\",ISBLANK(D8)),\" < Entry Required\",\"\")","v":""},null,null,{"$f":"IF(AND(E7=\"NS\",ISBLANK(H9)),\"click Drop-Down arrow below for town\",\"\")","v":""},null,null,null,null,null,null,"\"AB\"  \"MB\"  \"NB\"  \"NL\"  \"NS\"  \"NT\"  \"NU\"",null,null,null,null,null,null,null,null,null,null,null,null,null,null,null,null,null,null,null,null,null,null,null,"To Display ",null,{"$f":"IF(D11=1,AO9,IF(D11=2,AO10,IF(D11=3,AO11,IF(D11=4,AO12,\"\"))))","v":""},{"$f":"IF(D11=1,AP9,IF(D11=2,AP10,IF(D11=3,AP11,IF(D11=4,AP12,\"\"))))","v":""},null,null,null,null,"Land Fee Name",null,{"$f":"IF(E7=\"PQ\",AU16,IF(E7=\"Montreal\",AU24,IF(E7=\"SK\",AY16,IF(E7=\"YT\",BB16,\"\"))))","v":""},null,null,{"$f":"IF(E7=\"Montreal\",AX32,IF(E7=\"PQ\",AX23,IF(E7=\"SK\",BA23,IF(E7=\"YT\",BE23,\"\"))))","v":""}]
[null,{"$f":"IF(AND(E7=\"BC\",D8>1,D8<800000),\"Can. Citizen & Perm. Resident & New construction Y/N ? \",\"\")","v":""},null,null,{"$f":"IF(E7=\"ns\",\"      Select NS Town/Municipality >\",IF(AND(E7=\"BC\",D8>1,D8<800000,D9=\".\"),\"< Select: Yes or No\",\"\"))","v":""},null,null,null,null,null,null,null,null,null,"Land Fee Name",null,{"$f":"IF(E7=\"AB\",O16,IF(E7=\"MB\",R16,IF(E7=\"NB\",V16,IF(E7=\"NL\",Y16,IF(E7=\"NS\",AB16,IF(E7=\"NT\",AI16,IF(E7=\"NU\",AE16,\"\")))))))","v":""},null,null,null,null,null,null,null,null,null,null,null,null,null,null,null,null,null,null,null,null,null,"1 Buyer",null,{"$f":"IF(E7=\"ON\",AP23,IF(E7=\"Toronto\",AP51,IF(E7=\"PEI\",AT23,\"\")))","v":""},{"$f":"IF(E7=\"ON\",AP27-AO27,IF(E7=\"Toronto\",(AP23+AP48)-AO51,IF(E7=\"PEI\",AT23-AT30,\"\")))","v":""},null,null,null,null,"Land Fee Amount",null,{"$f":"IF(E7=\"SK\",AY24,IF(E7=\"YT\",BB24,\"\"))","v":""},null,null,{"$f":"IF(E7=\"SK\",BA32,IF(E7=\"YT\",BE33,\"\"))","v":""},null,null,null,null,null,null,null,null,"NOVA SCOTIA RATES"]
[null,null,{"$f":"IF(OR(E7=\"AB\",E7=\"NL\",E7=\"NU\",E7=\"NT\",E7=\"YT\"),\"Mortgage Amount\",\"\")","v":""},null,{"$f":"IF(AND(C10=\"Mortgage Amount\",E7<>\"\",ISBLANK(D9)),\" < Entry Required\",\"\")","v":""},{"$f":"IF(ISBLANK(H9),\"\",\"rate used\")","v":""},null,null,null,null,null,null,null,null,"Land Fee",null,{"$f":"IF(E7=\"AB\",Q19,IF(E7=\"MB\",U23,IF(E7=\"NB\",X23,IF(E7=\"NL\",AA23,IF(E7=\"NS\",D8*F11,IF(E7=\"NT\",AH23,IF(E7=\"NU\",AH23,\"\")))))))","v":""},null,null,null,null,null,null,null,null,null,null,null,null,null,null,null,null,null,null,null,null,null,"2 Buyers",null,{"$f":"IF(E7=\"ON\",AP23/2,IF(E7=\"Toronto\",AP51/2,IF(E7=\"PEI\",AT23/2,\"\")))","v":""},{"$f":"IF(E7=\"ON\",(AP27-AO27)/2,IF(E7=\"Toronto\",AP9/2,IF(E7=\"PEI\",(AT23-AT30)/2,\"\")))","v":""},null,null,null,null,"Mortgage Fee Name",null,{"$f":"IF(AND(E7=\"YT\",BE22>0),\"Assurance Fund Fee\",\"\")","v":""},null,null,{"$f":"IF(AND(E7=\"YT\",BE22>0),BE22,\"\")","v":""},null,null,null,null,null,null,null,null,"County","Municipality","Rate"]
{"$rows_left_out":59}
{"sheet":"Parameters","index":7,"n_rows":16,"n_cols":3,"rows_kept":16,"cut":false,"hidden":true,"merged":[[1,0,1,2]]}
["Prompts","Values","Description"]
["Do not alter the position of any cells,  their locations are hard-coded in the VBA\n    ***  do not insert any rows or columns ****"]
["Datastore Workbook name (NEW)","MMDataStore16.xlsm","Current version of workbook  ( these MUST be sequential: 1, 2, 3, ...)\nwith the newest 1 higher than the previous"]
["Datastore Worksheet","BuyNowDATA","Name of data worksheet in \"MMDATAStore\" workbook"]
["FileNumber Worksheet","The Options","Worksheet with File reference number cell "]
["Filenumber Cell","FileNumber","Cell on the source worksheet where the DataStore File reference number is entered/replaced to"]
["Old Datastore Workbook name (OLD)","MMDataStore14.xlsm,MMDataStore145xlsm","Name of the previous DataStore workbook (insert a string of comma seperated previous workbooks that are to be copied forward to the \"NEW\" DataStore shown in the upper orange cell on this sheet) \nthese MUST be sequential: 1, 2, 3, ..."]
["Old Datastore Worksheet","BuyNowDATA","Name of of the sheet within the previous DataStore workbook"]
["Bank Prime",3.95E-2,"NOT used with this workbook"]
["Save Until cell","SaveUntil","Cell on the source worksheet where the DataStore File Funding Date is entered/replaced to"]
{"$rows_left_out":7}
{"sheet":"Agreement","index":8,"n_rows":47,"n_cols":2,"rows_kept":47,"cut":false,"hidden":true,"merged":[]}
[]
[null,"Mortgage Mentor: Disclaimer, Privacy Policy, and License Agreement"]
[]
[null,"Read the terms and conditions of this license agreement carefully.  "]
[null,"By: downloading, otherwise receiving, or using a copy of the program, you are accepting and agreeing to the terms of this license agreement."]
[null,"continued…"]
[null,"1.     The program is copyrighted and licensed (not sold). This is a legal agreement between you (either an individual end-user or an entity) and MMI Mortgage Mentor Inc. (“MMI”) . If you do not agree to the terms and conditions of this agreement, you must promptly stop using the Software, remove it from any computer on which you have installed it, and destroy all aspects of the Software in your possession or control."]
[null,"continued…"]
[null,"2.      At MMI, we are committed to respecting and protecting your privacy and security.  We have taken measures to protect the security of your personal information and protect your data from misuse and unauthorized access or disclosure. While any data transmissions over the internet cannot be guaranteed 100%, MMI would like to reassure our subscribers that our site www.mortgagementor.com is protected by CopyMinder (www.copyminder.com). To further protect your security, we are providing each subscriber with a unique Product Key for their personal use only.  By using this software you agree that your Product Key shall not be shared, distributed or broadcast to any other parties."]
[null,"continued…"]
{"$rows_left_out":37}