{"text_format":"1","workbook":"xlsx","n_sheets":4,"sheets":["Veil","Introduction","Comparison","Agreement"],"not_rendered":{"charts":0,"images":5,"macros":1,"external_links":1,"defined_names":3,"comments":2,"pivot_tables":0},"unopened":[],"bounds":{"document_bytes":16777216,"sheet_cells":100000,"rows_first":2000,"rows_last":500,"rows_between":2000,"halvings":0,"cell_chars":16384,"cell_head_chars":4096},"cells_cut":0,"cells_raw":0,"read":"whole","date_system":"1900"}

{"sheet":"Veil","index":0,"n_rows":23,"n_cols":3,"rows_kept":23,"cut":false,"hidden":false,"merged":[]}
[]
[]
[]
[null,null," Copy Protection Test in Progress"]
[]
[null,null,"This sheet should appear temporarily while your computer runs"]
[null,null,"a brief test of a third party copy protection system."]
[]
[]
[null,null,"If this sheet remains on your screen for more that a 30 seconds,"]
[null,null,"one of three known conditions likely exists."]
[]
[]
[null,null,"1. an internet connection is not available"]
[]
[null,null,"2.  this copy is not registered for this computer,"]
[null,null,"you can obtain subscription info by contacting"]
[null,null,"www.mortgagementor.com/contact-us"]
[]
[null,null,"3. you are registering a new Mortgage Mentor installation on a MAC"]
{"$rows_left_out":4}
{"sheet":"Introduction","index":1,"n_rows":30,"n_cols":5,"rows_kept":30,"cut":false,"hidden":true,"merged":[[2,1,2,5],[17,3,17,4],[6,2,6,3],[14,3,14,4],[15,3,15,4],[9,3,9,4],[22,1,23,5],[27,1,27,4],[4,3,4,4],[7,3,7,4],[11,3,11,4],[12,3,12,4],[25,1,25,3]]}
[]
[]
[null,"This tool is best used as an active spreadsheet using Microsoft Excel."]
[null,null,null,null,"Please read the attached \"Agreement\" before using this tool"]
[]
[]
[null,null,"Comparison Tab"]
[null,null,null,"This comparison table has \"locked\" titles on both the top and left side.  This enables you to scroll throughout the spreadsheet without losing your reference titles."]
[]
[null,null,null,"Cells shaded like this one, indicate there are footnotes for this feature.  To automatically see the footnote on-screen, simply place your mouse pointer over that cell.  Try it here."]
[]
[null,null,null,"Products may be \"Filtered\" or short-listed to help you select the options that apply to your client."]
[null,null,null,"By criterion - to see the short list of the products that fit your clients: LTV, Beacon, income source, etc. simply click on the down arrow in the applicable title cell.  A drop down list of all the options  listed will appear.  Within that new drop-down list, click on the data that most closely fits your clients circumstances and a \"short-list\" of the matching lenders will be left for your review.  You can \"Filter\" on more than one title at a time.  For more details on using the the filter tool contact your RSM."]
[]
[null,null,null,"a \"-\" in a Cell/Box indicates that we have asked for the information and there is none that applies. "]
[null,null,null,"a blank Cell/Box or one marked \"Under Advisement\" indicates that the lender has not provided a definite answer yet."]
[]
[null,null,null,"With the exception of Home Trust and Van City, regional lenders have not been included in this tool.  If you have regional lenders in your market area, please forward the email address for their representative and we will add their information to a future"]
[]
[]
{"$rows_left_out":11}
{"sheet":"Comparison","index":2,"n_rows":48,"n_cols":44,"rows_kept":48,"cut":false,"hidden":true,"merged":[[3,25,4,25],[2,35,2,42],[3,11,3,12],[3,13,3,14],[3,16,4,16],[2,16,2,18],[2,3,2,14],[3,10,4,10],[0,6,0,43],[3,19,4,19],[3,20,4,20],[3,23,4,23],[3,21,4,21],[3,18,4,18],[3,43,4,43],[3,31,4,31],[3,27,4,27],[3,26,4,26],[3,17,4,17],[3,28,4,28],[3,40,4,40],[3,15,4,15],[2,28,2,34],[3,24,4,24],[49,3,49,9],[45,1,45,5],[3,3,4,3],[3,9,4,9],[40,1,40,8],[3,4,4,4],[3,6,4,6],[3,7,3,8],[1,1,5,1],[3,5,4,5],[1,2,1,8],[1,9,1,43],[3,41,4,41],[3,42,4,42],[2,19,2,27],[3,22,4,22],[40,28,40,38],[3,36,4,36],[3,37,4,37],[3,38,4,38],[3,33,4,33],[3,34,4,34],[3,32,4,32],[3,29,4,29],[3,30,4,30],[3,35,4,35]]}
[]
[null,"\"Building the best Broker tools since the fax machine!\"\n\nUpdating suspended May 2018","© printing or copying this page or any portion of this page, in any way, without prior written permission of the author is prohibited ",null,null,null,null,null,null,{"$f":"REPT(\"Linus by MORTGAGE MENTOR     : : :    \",15)","v":"Linus by MORTGAGE MENTOR     : : :    Linus by MORTGAGE MENTOR     : : :    Linus by MORTGAGE MENTOR     : : :    Linus by MORTGAGE MENTOR     : : :    Linus by MORTGAGE MENTOR     : : :    Linus by MORTGAGE MENTOR     : : :    Linus by MORTGAGE MENTOR     : : :    Linus by MORTGAGE MENTOR     : : :    Linus by MORTGAGE MENTOR     : : :    Linus by MORTGAGE MENTOR     : : :    Linus by MORTGAGE MENTOR     : : :    Linus by MORTGAGE MENTOR     : : :    Linus by MORTGAGE MENTOR     : : :    Linus by MORTGAGE MENTOR     : : :    Linus by MORTGAGE MENTOR     : : :    "}]
[null,null,null,"PRODUCT SELECTION",null,null,null,null,null,null,null,null,null,null,null,null,"RATE",null,null," CUSTOMER USE",null,null,null,null,null,null,null,null," APPROVAL",null,null,null,null,null,null,"MISCELLANEOUS"]
[null,null,null,"Lending Area","Max No. Applicants","LTV (%) Maximum","Beacon Minimum","Loan Amount",null,"Purpose","Property Type","Conventional",null,"Insured",null,"Amort. Max","Qualifying Rate","Rate","Compounding","Minimum Payment","Cheques","Min Draw","Extra Payments","Convert to Fixed","Funds Access","Funds Availability","Monthly Statement","Annual Review","Security","LOC  Insurance Surcharge","Title Insurance","Client set-up costs","Appraisal","Application Fee","Credit","Assumable","Portable","Transfer \"out\""," Switch  \"in\"","Refinance","LOC Rate Float","Product Advantage","LOC Finders Fees","Volume Bonus"]
[null,null,null,null,null,null,null,"Minimum","Maximum",null,null,"GDS %","TDS %","GDS %","TDS %"]
[]
["B2B Bank","B2B Bank         ( Homeowner's Kit )",{"$f":"VLOOKUP(A7,'[1]My Six'!$F$2:$G$38,2,FALSE)","v":{"$error":"#N/A"}},"National",4,80,650,50000,750000,"O/O Max 2 units","Purchase, Re-Fi",32,40," -"," -",35,"BoC Benchmark","P+.25%","Semi Ann.","Interest Only","Yes & Phone & Bank Card","No","Cheque","No","Debit, ABM, Card, Online, Cheque","Immediate","Online","Yes","1st Mort.","No","Always","Appraisal, Title Ins","Lender List\n or service","No","Regular Mortgage Requirements","No","No","No","No","Yes","Monthly","up to 3 Mortgage components and 3 HELOCs under 1 global limit. HELOC's available at 80% LTV","50 BP on Auth.","Yes"]
["B2B Bank","B2B Bank   ( N.I.Q. Homeowner's Kit )",{"$f":"VLOOKUP(A8,'[1]My Six'!$F$2:$G$38,2,FALSE)","v":{"$error":"#N/A"}},"National",4,65,650,50000,350000,"O/O Max 2 units","Purchase, Re-Fi",32,40," -"," -",35,"BoC Benchmark","P+.25%","Semi Ann.","Interest Only","Yes & Phone & Bank Card","No","Cheque","No","Debit, ABM, Card, Online, Cheque","Immediate","Online","Yes","1st Mort.","No","Always","Appraisal, Title Ins","Lender List\n or service","No","Regular Mortgage Requirements","No","No","No","No","Yes","Monthly","up to 3 Mortgage components and 3 HELOCs under 1 global limit. HELOC's available at 80% LTV","50 bp on Auth.","Yes"]
["B2B Bank","B2B Bank         ( Standard HELOC )",{"$f":"VLOOKUP(A9,'[1]My Six'!$F$2:$G$38,2,FALSE)","v":{"$error":"#N/A"}},"National",4,65,650,50000,750000,"O/O Max 2 units","Purchase, Re-Fi",32,40," -"," -","n/a","BoC Benchmark","P+.25%","Semi Ann.","Interest Only","Yes & Phone & Bank Card","No","Cheque","No","Debit, ABM, Card, Online, Cheque","Immediate","Online","Yes","1st Mort.","No","Always","Appraisal, Title Ins","Lender List\n or service","No","Regular Mortgage Requirements","No","No","No","No","Yes","Monthly","Paid on approved limit","50 bp on Auth.","Yes"]
["B2B Bank","B2B Bank \n      ( Self Employed Provable HELOC )",{"$f":"VLOOKUP(A10,'[1]My Six'!$F$2:$G$38,2,FALSE)","v":{"$error":"#N/A"}},"National",4,65,650,50000,750000,"O/O Max 2 units,\nno Condos","Purchase, \nRe-Fi, ETO",32,40," -"," -","n/a","BoC Benchmark","P+2.00%","Semi Ann.","Interest Only","Yes & Phone & Bank Card","No","Cheque","No","Debit, ABM, Card, Online, Cheque","Immediate","Mail and/or Online","Yes","1st Mort.","No","Always","Appraisal, Title Ins","Lender List\n or service","No","No negative info on Bureau","No","No","No","No","Yes","Monthly","Few lenders offer this product through brokers","50 bp on Auth.","Yes"]
["B2B Bank","B2B Bank \n         ( Self Employed Stated HELOC )",{"$f":"VLOOKUP(A11,'[1]My Six'!$F$2:$G$38,2,FALSE)","v":{"$error":"#N/A"}},"National",4,65,650,50000,350000,"O/O Max 2 units,\nno Condos","Purchase, \nRe-Fi, ETO",32,40," -"," -","n/a","BoC Benchmark","P+2.00%","Semi Ann.","Interest Only","Yes & Phone & Bank Card","No","Cheque","No","Debit, ABM, Card, Online, Cheque","Immediate","Mail and/or Online","Yes","1st Mort.","No","Always","Appraisal, Title Ins","Lender List\n or service","No","No negative info on Bureau","No","No","No","No",null,"Monthly","No evidence of income required\n NOA re no taxes owing is required","50 bp on Auth.","Yes"]
["Equitable Bank","Equitable Bank  ( Home Equity Line Of Credit )\n                 Stand Alone O/O HELOC",{"$f":"VLOOKUP(A12,'[1]My Six'!$F$2:$G$38,2,FALSE)","v":{"$error":"#N/A"}},"National exc. PQ","no Max",65,500,75000,500000,"O/O Max 4 units","Purchase, Re-Fi",48,48," -"," -","n/a","higher of 5yr Benchmark or Deal Rate +2.00%","P+4.74% to P+10.49%","Monthly","Interest Only","Yes & Phone & VISA Card","No","Cheque, online via bank","No","Debit, ABM, VISA,  Cheque","Immediate","Mail and/or Online","Yes","1st Mort.","No","Always","Appraisal, Title Ins","Lender List\n or service","1.5% of Limit","Regular Alternative Mortgage rules","No","No","No","No","Yes","with Prime","No annual fees, No interest on purchases made during statement period. Online access.","50 BP on Auth.","Yes"]
["Equitable Bank","Equitable Bank  ( Home Equity Line Of Credit )\n                 Stand Alone Rental HELOC",{"$f":"VLOOKUP(A13,'[1]My Six'!$F$2:$G$38,2,FALSE)","v":{"$error":"#N/A"}},"National exc. PQ","no Max",65,500,75000,500000,"Rental Max 4 units","Purchase, Re-Fi",48,48," -"," -","n/a","higher of 5yr Benchmark or Deal Rate +2.00%","add 50 bp","Monthly","Interest Only","Yes & Phone & VISA Card","No","Cheque, online via bank","No","Debit, ABM, VISA,  Cheque","Immediate","Mail and/or Online","Yes","1st Mort.","No","Always","Appraisal, Title Ins","Lender List\n or service","1.5% of Limit","Regular Alternative Mortgage rules","No","No","No","No","Yes","with Prime","No annual fees, No interest on purchases made during statement period. Online access.","50 BP on Auth.","Yes"]
["Equitable Bank","Equitable Bank  ( Home Equity Line Of Credit )\n                 added to a mortgage",{"$f":"VLOOKUP(A14,'[1]My Six'!$F$2:$G$38,2,FALSE)","v":{"$error":"#N/A"}},"National exc. PQ","no Max",65,500,1000,100000,"O/O Max 4 units","Purchase, Re-Fi",48,48," -"," -","n/a","higher of 5yr Benchmark or Deal Rate +2.00%","P+4.74% to P+10.49%","Monthly","Interest Only","Yes & Phone & VISA Card","No","Cheque, online via bank","No","Debit, ABM, VISA,  Cheque","Immediate","Mail and/or Online","Yes","1st Mort.","No","Always","Appraisal, Title Ins","Lender List\n or service","No","Regular Alternative Mortgage rules","No","No","No","No","Yes","with Prime","No annual fees, No interest on purchases made during statement period. Online access.","1yr 50bp, 2yr 60bp, 3yr 75bp, 4yr 90bp, 5yr 110bp","Yes"]
["Equitable Bank","Equitable Bank  ( Rental Equity Line Of Credit )\n                 added to a mortgage",{"$f":"VLOOKUP(A15,'[1]My Six'!$F$2:$G$38,2,FALSE)","v":{"$error":"#N/A"}},"ON only","no Max",65,600,10000,100000,"Rental Max 4 units","Purchase, Re-Fi",48,48," -"," -","n/a","higher of 5yr Benchmark or Deal Rate +2.00%","P+4.74% to P+5.74%","Monthly","Interest Only","Yes & Phone & VISA Card","No","Cheque, online via bank","No","Debit, ABM, VISA,  Cheque","Immediate","Mail and/or Online","Yes","1st Mort.","No","Always","Appraisal, Title Ins","Lender List\n or service","No","Regular Alternative Mortgage rules","No","No","No","No","Yes","with Prime","No annual fees, No interest on purchases made during statement period. Online access.","1yr 50bp, 2yr 60bp, 3yr 75bp, 4yr 90bp, 5yr 110bp","Yes"]
["Home Trust","Home Trust  ( ELV - Equityline Visa 1st )",{"$f":"VLOOKUP(A16,'[1]My Six'!$F$2:$G$38,2,FALSE)","v":{"$error":"#N/A"}},"BC AB SK MB ON",4,65,620,7500,500000,"O/O Max 4 units","Any: Purchase, Re-Fi, Reno's",44,44," -"," -","based on Min Pmt.","higher of 5yr Benchmark or Deal Rate +2.00%","4.99% to 13.99%","Daily","1.00% of balance","Yes & Visa","No","Online, Tel.Bank, Mail","No","Visa Card, Cheque","Immediate","Mail","No","1st Mort.","No","Always","Appraisal, 3% Fee, \nTitle Insurance, Search","Broker from list","1% to 2%\n Approved limit","Regular Mortgage Qualification","No","No","No","No","Yes","Daily","1% Cash-Back on purchases, Equity Based, fully open, \nFinders Fees based on Approved limit.","100 bp\n (1/2 of H.T.'s 2%)","No"]
["Home Trust","Home Trust  ( ELV - Equityline Visa 2nd )",{"$f":"VLOOKUP(A17,'[1]My Six'!$F$2:$G$38,2,FALSE)","v":{"$error":"#N/A"}},"BC AB SK MB ON",4,65,620,7500,100000,"O/O Max 4 units","Any: Purchase, Re-Fi, Reno's",44,44," -"," -","based on Min Pmt.","higher of 5yr Benchmark or Deal Rate +2.00%","4.99% to 13.99%","Daily","1.00% of balance","Yes & Visa","No","Online, Tel.Bank, Mail","No","Visa Card, Cheque","Immediate","Mail","No","2nd Mort.","No","Always","Appraisal, 3% Fee, \nTitle Insurance, Search","Broker from list","1% to 2%\n Approved limit","Regular Mortgage Qualification","No","No","No","No","Yes","Daily","1% Cash-Back on purchases, Equity Based, fully open, \nFinders Fees based on Approved limit.","100 bp\n (1/2 of H.T.'s 2%)","No"]
["Home Trust","Home Trust  ( RENTAL Equityline Visa )",{"$f":"VLOOKUP(A18,'[1]My Six'!$F$2:$G$38,2,FALSE)","v":{"$error":"#N/A"}},"ON only\n by exception",4,65,620,7500,100000,"Rental Max 4 units","Any: Purchase, Re-Fi, Reno's",44,44," -"," -","based on Min Pmt.","higher of 5yr Benchmark or Deal Rate +2.00%","5.99% to 13.99%","Daily","1.00% of balance","Yes & Visa","No","Online, Tel.Bank, Mail","No","Visa Card, Cheque","Immediate","Mail","No","1st or 2nd","No","Always","Appraisal, 3% Fee, \nTitle Insurance, Search","Broker from list","1% to 2%\n Approved limit","Regular Mortgage Qualification","No","No","No","No","Yes","Daily","1% Cash-Back on purchases, Equity Based, fully open, \nFinders Fees based on Approved limit.","100 bp\n (1/2 of H.T.'s 2%)","No"]
["Home Trust","Home Trust             ( Secured Visa )",{"$f":"VLOOKUP(A19,'[1]My Six'!$F$2:$G$38,2,FALSE)","v":{"$error":"#N/A"}},"Provinces\n exc PQ",2,"n/a","n/a",500,10000,"n/a","n/a"," -"," -"," -"," -","based on Min Pmt.","higher of 5yr Benchmark or Deal Rate +2.00%",0.19989999999999999,"Daily","3.00% of balance\n or $10","Yes & Visa","No","Online, Tel.Bank, Mail","No","Visa Card, Cheque","Immediate","Mail","No","n/a","No","n/a","Deposit","n/a","No","n/a","No","No","No","No","Yes","Daily","help Canadians establish or re-establish credit",35,"No"]
["Home Trust","Home Trust           ( ONE CHARGE )",{"$f":"VLOOKUP(A20,'[1]My Six'!$F$2:$G$38,2,FALSE)","v":{"$error":"#N/A"}},"National",4,"80 / 75",575,7500,250000,"O/O Max 4 units","Any: Purchase, Re-Fi, Reno's","Will Look At","Will Look At"," -"," -","based on Min Pmt.","BoC Benchmark","4.99% to 13.99%","Daily","1.00% of balance","Yes & Visa","No","Online, Tel.Bank, Mail","No","Visa Card, Cheque","Immediate","Mail","No","1st Mort.","No","Always","Incl. in mortgage set-up","Broker from list","No","Regular Mortgage Qualification","No","No","No","No","Yes","Daily","Flexibility of account, \n2 components with only 1 set of set-up costs","$100 - $250 on the ELV\n regular on the Classic","No"]
{"$rows_left_out":29}
{"sheet":"Agreement","index":3,"n_rows":47,"n_cols":2,"rows_kept":47,"cut":false,"hidden":true,"merged":[]}
[]
[null,"Mortgage Mentor: Disclaimer, Privacy Policy, and License Agreement"]
[]
[null,"Read the terms and conditions of this license agreement carefully.  "]
[null,"By: downloading, otherwise receiving, or using a copy of the program, you are accepting and agreeing to the terms of this license agreement."]
[null,"continued…"]
[null,"1.     The program is copyrighted and licensed (not sold). This is a legal agreement between you (either an individual end-user or an entity) and MMI Mortgage Mentor Inc. (“MMI”) . If you do not agree to the terms and conditions of this agreement, you must promptly stop using the Software, remove it from any computer on which you have installed it, and destroy all aspects of the Software in your possession or control."]
[null,"continued…"]
[null,"2.      At MMI, we are committed to respecting and protecting your privacy and security.  We have taken measures to protect the security of your personal information and protect your data from misuse and unauthorized access or disclosure. While any data transmissions over the internet cannot be guaranteed 100%, MMI would like to reassure our subscribers that our site www.mortgagementor.com is protected by COPYminder (www.copyminder.com). To further protect your security, we are providing each subscriber with a unique Product Key for their personal use only.  By using this software you agree that your Product Key shall not be shared, distributed or broadcast to any other parties."]
[null,"continued…"]
[null,"3.    Each Product Key and Mortgage Mentor Tool (from herein referred to as “Software”) are protected by COPYminder.  Periodically throughout the duration of your subscription, your Product Key and computer ID will need to be re-validated by COPYminder’s protection system. To facilitate this, your computer will need to be connected to the internet.  No data is copied, installed, or accessed from your computer during this process. You agree to allow COPYminder access to the Software installed on your computer solely for such re-validation purposes."]
[null,"continued…"]
[null,"4.     The Software that is made available for downloading from our online server is owned by MMI.  This Software is protected by copyright laws, and is  licensed to you on a non-exclusive limited basis to be used by you in accordance with the terms and conditions described herein.  Any use, reproduction or redistribution of the Software that is not in accordance with the terms and conditions in this agreement is expressly prohibited by law, and may result in civil and criminal penalties."]
[null,"continued…"]
[null,"5.     This Software is licensed, not sold, for use under the terms and conditions of this agreement, and MMI reserves all rights not expressly granted in this agreement. Without limiting the generality of the forgoing MMI retains ownership of  the Software, and all intellectual property rights therein.  As such, you acknowledge and agree that MMI holds all rights to title and interest in all tangible and intangible incidents of the product and/or service, including copyrights and trade secrets pertaining thereto, and that this agreement conveys to you only a limited right to access and use of the product and/or service.  Subject to the terms and conditions of this agreement, MMI grants to you a non-exclusive limited license to use one copy of the Software and any documentation accompanying this agreement on one computer only.  No other rights are granted.  You may not use the Software on different computers concurrently using the same Product Key.  Attempts to install this Software on a second computer will cause the original, authorized installation to malfunction."]
[null,"continued…"]
[null,"6.      The Software contains copyrighted concepts, ideas, and other proprietary materials of MMI. You agree not to analyze, reverse engineer, decompile or disassemble the Software, or any part of the Software.  You also agree to not modify or create derivative works of the Software, combine with or incorporate the Software into any other application Software, print a copy of the Software, reproduce, distribute, publish, resell for profit, broadcast, transmit or provide its functionality, or commercially exploit the Software and any information available on this site in any matter without the express consent of MMI. AND IS PROHIBITED WITHOUT THE EXPRESS WRITTEN PERMISSION OF MMI."]
[null,"continued…"]
[null,"7.      The Software is considered in use if it is loaded on the computer’s permanent or temporary memory.  If you are acquiring the Software on behalf of another person or entity, you represent and warrant that you have the authority to bind the party or"]
[null,"continued…"]
{"$rows_left_out":27}